Download raw body.
UPDATE: Asio 1.36.0
galera runs into a problem if new asio is present during build:
FAILED: galerautils/src/CMakeFiles/galerautilsxx.dir/gu_asio.cpp.o
/pobj/galera-26.4.16/bin/c++ -DBOOST_DATE_TIME_POSIX_TIME_STD_CONFIG=1 -DGALERA_HAVE_SSL -DGU_CRC32C_NO_HARDWARE -DHAVE_ASIO_HPP -DHAVE_BOOST_SHARED_PTR_HPP -DHAVE_COMMON_H -DHAVE_ENDIAN_H -DHAVE_STD_ARRAY -DHAVE_STD_UNORDERED_MAP -DNDEBUG -DOPENSSL_HAS_SET_ECDH_AUTO -I/pobj/galera-26.4.16/galera-release_26.4.16 -I/pobj/galera-26.4.16/galera-release_26.4.16/common -I/pobj/galera-26.4.16/galera-release_26.4.16/galera/src -I/pobj/galera-26.4.16/galera-release_26.4.16/galerautils/src -I/pobj/galera-26.4.16/galera-release_26.4.16/gcache/src -I/pobj/galera-26.4.16/galera-release_26.4.16/gcomm/src -I/pobj/galera-26.4.16/galera-release_26.4.16/gcs/src -I/pobj/galera-26.4.16/galera-release_26.4.16/wsrep/src -O2 -pipe -I/usr/local/include -Wall -Wextra -Woverloaded-virtual -g -DNDEBUG -std=gnu++11 -fPIC -Wno-conversion -Wno-unused-parameter -MD -MT galerautils/src/CMakeFiles/galerautilsxx.dir/gu_asio.cpp.o -MF galerautils/src/CMakeFiles/galerautilsxx.dir/gu_asio.cpp.o.d -o galerautils/src/CMakeFiles/galerautilsxx.dir/gu_asio.cpp.o -c /pobj/galera-26.4.16/galera-release_26.4.16/galerautils/src/gu_asio.cpp
In file included from /pobj/galera-26.4.16/galera-release_26.4.16/galerautils/src/gu_asio.cpp:23:
/pobj/galera-26.4.16/galera-release_26.4.16/galerautils/src/gu_asio_datagram.hpp:38:34: error: no type named 'iterator' in 'asio::ip::basic_resolver<asio::ip::udp>'
38 | asio::ip::udp::resolver::iterator resolve_and_open(const gu::URI& uri);
| ~~~~~~~~~~~~~~~~~~~~~~~~~^
In file included from /pobj/galera-26.4.16/galera-release_26.4.16/galerautils/src/gu_asio.cpp:26:
/pobj/galera-26.4.16/galera-release_26.4.16/galerautils/src/gu_asio_io_service_impl.hpp:19:10: fatal error: 'asio/io_service.hpp' file not found
19 | #include "asio/io_service.hpp"
| ^~~~~~~~~~~~~~~~~~~~~
2 errors generated.
ninja: build stopped: subcommand failed.
>>> Building on i386-3 under databases/galera
BDEPENDS = [devel/cmake/core;devel/boost;devel/ninja;devel/check]
DIST = [databases/galera:galera-release_26.4.16.tar.gz;databases/galera:wsrep-api-694d6ca47f5eec7873be99b7d6babccf633d1231.tar.gz]
FULLPKGNAME = galera-26.4.16
RDEPENDS = [devel/boost]
(Junk lock obtained for i386-3 at 1791273821.78)
>>> Running depends in databases/galera at 1791273821.81
last junk was in security/libpwquality
/usr/sbin/pkg_add -aI -Drepair boost-1.91.0p1v0 check-0.15.2p0
was: /usr/sbin/pkg_add -aI -Drepair boost-1.91.0p1v0 check-0.15.2p0 cmake-core-4.3.5 ninja-1.11.1p1v1
/usr/sbin/pkg_add -aI -Drepair boost-1.91.0p1v0 check-0.15.2p0
>>> Running show-prepare-results in databases/galera at 1791273833.64
===> databases/galera
===> Building from scratch galera-26.4.16
===> galera-26.4.16 depends on: check-* -> check-0.15.2p0
===> galera-26.4.16 depends on: cmake-core->=4 -> cmake-core-4.3.5
===> galera-26.4.16 depends on: ninja-* -> ninja-1.11.1p1v1
===> galera-26.4.16 depends on: boost-* -> boost-1.91.0p1v0
===> Verifying specs: c++ c++abi pthread boost_program_options-mt c crypto m ssl
===> found c++.13.0 c++abi.10.0 pthread.28.1 boost_program_options-mt.27.0 c.104.0 crypto.57.2 m.10.1 ssl.60.2
boost-1.91.0p1v0
check-0.15.2p0
cmake-core-4.3.5
ninja-1.11.1p1v1
(Junk lock released for i386-3 at 1791273835.82)
distfiles size=3680783
>>> Running patch in databases/galera at 1791273835.85
===> databases/galera
===> Checking files for galera-26.4.16
`/mnt/distfiles/galera-release_26.4.16.tar.gz' is up to date.
`/mnt/distfiles/wsrep-api-694d6ca47f5eec7873be99b7d6babccf633d1231.tar.gz' is up to date.
>> (SHA256) all files: OK
===> Extracting for galera-26.4.16
===> Patching for galera-26.4.16
===> Applying OpenBSD patch patch-asio_asio_ssl_impl_context_ipp
Hmm... Looks like a unified diff to me...
The text leading up to this was:
--------------------------
|Index: asio/asio/ssl/impl/context.ipp
|--- asio/asio/ssl/impl/context.ipp.orig
|+++ asio/asio/ssl/impl/context.ipp
--------------------------
Patching file asio/asio/ssl/impl/context.ipp using Plan A...
Hunk #1 succeeded at 87.
Hunk #2 succeeded at 132.
Hunk #3 succeeded at 177.
Hunk #4 succeeded at 222.
Hunk #5 succeeded at 267.
Hunk #6 succeeded at 293.
Hunk #7 succeeded at 300.
Hunk #8 succeeded at 313.
Hunk #9 succeeded at 383.
Hunk #10 succeeded at 395.
Hunk #11 succeeded at 733.
Hunk #12 succeeded at 761.
Hunk #13 succeeded at 839.
Hunk #14 succeeded at 907.
Hunk #15 succeeded at 1147.
done
===> Applying OpenBSD patch patch-cmake_os_cmake
Hmm... Looks like a unified diff to me...
The text leading up to this was:
--------------------------
|Index: cmake/os.cmake
|--- cmake/os.cmake.orig
|+++ cmake/os.cmake
--------------------------
Patching file cmake/os.cmake using Plan A...
Hunk #1 succeeded at 6.
done
===> Applying OpenBSD patch patch-galerautils_src_gu_arch_h
Hmm... Looks like a unified diff to me...
The text leading up to this was:
--------------------------
|Index: galerautils/src/gu_arch.h
|--- galerautils/src/gu_arch.h.orig
|+++ galerautils/src/gu_arch.h
--------------------------
Patching file galerautils/src/gu_arch.h using Plan A...
Hunk #1 succeeded at 41.
done
===> Applying OpenBSD patch patch-galerautils_src_gu_asio_socket_util_hpp
Hmm... Looks like a unified diff to me...
The text leading up to this was:
--------------------------
|Index: galerautils/src/gu_asio_socket_util.hpp
|--- galerautils/src/gu_asio_socket_util.hpp.orig
|+++ galerautils/src/gu_asio_socket_util.hpp
--------------------------
Patching file galerautils/src/gu_asio_socket_util.hpp using Plan A...
Hunk #1 succeeded at 148.
done
===> Applying OpenBSD patch patch-galerautils_src_gu_byteswap_h
Hmm... Looks like a unified diff to me...
The text leading up to this was:
--------------------------
|Index: galerautils/src/gu_byteswap.h
|--- galerautils/src/gu_byteswap.h.orig
|+++ galerautils/src/gu_byteswap.h
--------------------------
Patching file galerautils/src/gu_byteswap.h using Plan A...
Hunk #1 succeeded at 57.
done
===> Applying OpenBSD patch patch-galerautils_src_gu_errno_h
Hmm... Looks like a unified diff to me...
The text leading up to this was:
--------------------------
|Index: galerautils/src/gu_errno.h
|--- galerautils/src/gu_errno.h.orig
|+++ galerautils/src/gu_errno.h
--------------------------
Patching file galerautils/src/gu_errno.h using Plan A...
Hunk #1 succeeded at 7.
done
===> Applying OpenBSD patch patch-galerautils_src_gu_fdesc_cpp
Hmm... Looks like a unified diff to me...
The text leading up to this was:
--------------------------
|Index: galerautils/src/gu_fdesc.cpp
|--- galerautils/src/gu_fdesc.cpp.orig
|+++ galerautils/src/gu_fdesc.cpp
--------------------------
Patching file galerautils/src/gu_fdesc.cpp using Plan A...
Hunk #1 succeeded at 235.
done
===> Applying OpenBSD patch patch-galerautils_src_gu_resolver_cpp
Hmm... Looks like a unified diff to me...
The text leading up to this was:
--------------------------
|Index: galerautils/src/gu_resolver.cpp
|--- galerautils/src/gu_resolver.cpp.orig
|+++ galerautils/src/gu_resolver.cpp
--------------------------
Patching file galerautils/src/gu_resolver.cpp using Plan A...
Hunk #1 succeeded at 17.
Hunk #2 succeeded at 79.
Hunk #3 succeeded at 208.
Hunk #4 succeeded at 272.
done
===> Applying OpenBSD patch patch-galerautils_src_gu_system_h
Hmm... Looks like a unified diff to me...
The text leading up to this was:
--------------------------
|Index: galerautils/src/gu_system.h
|--- galerautils/src/gu_system.h.orig
|+++ galerautils/src/gu_system.h
--------------------------
Patching file galerautils/src/gu_system.h using Plan A...
Hunk #1 succeeded at 23.
done
===> Applying OpenBSD patch patch-galerautils_tests_CMakeLists_txt
Hmm... Looks like a unified diff to me...
The text leading up to this was:
--------------------------
|Index: galerautils/tests/CMakeLists.txt
|--- galerautils/tests/CMakeLists.txt.orig
|+++ galerautils/tests/CMakeLists.txt
--------------------------
Patching file galerautils/tests/CMakeLists.txt using Plan A...
Hunk #1 succeeded at 104.
done
===> Applying OpenBSD patch patch-gcache_src_CMakeLists_txt
Hmm... Looks like a unified diff to me...
The text leading up to this was:
--------------------------
|Index: gcache/src/CMakeLists.txt
|--- gcache/src/CMakeLists.txt.orig
|+++ gcache/src/CMakeLists.txt
--------------------------
Patching file gcache/src/CMakeLists.txt using Plan A...
Hunk #1 succeeded at 32.
done
===> Applying OpenBSD patch patch-gcache_src_gcache_page_cpp
Hmm... Looks like a unified diff to me...
The text leading up to this was:
--------------------------
|Index: gcache/src/gcache_page.cpp
|--- gcache/src/gcache_page.cpp.orig
|+++ gcache/src/gcache_page.cpp
--------------------------
Patching file gcache/src/gcache_page.cpp using Plan A...
Hunk #1 succeeded at 35.
done
===> Applying OpenBSD patch patch-gcs_src_gcs_spread_cpp
Hmm... Looks like a unified diff to me...
The text leading up to this was:
--------------------------
|Index: gcs/src/gcs_spread.cpp
|--- gcs/src/gcs_spread.cpp.orig
|+++ gcs/src/gcs_spread.cpp
--------------------------
Patching file gcs/src/gcs_spread.cpp using Plan A...
Hunk #1 succeeded at 654.
done
===> Applying OpenBSD patch patch-wsrep_tests_CMakeLists_txt
Hmm... Looks like a unified diff to me...
The text leading up to this was:
--------------------------
|Index: wsrep/tests/CMakeLists.txt
|--- wsrep/tests/CMakeLists.txt.orig
|+++ wsrep/tests/CMakeLists.txt
--------------------------
Patching file wsrep/tests/CMakeLists.txt using Plan A...
Hunk #1 succeeded at 17.
done
===> Compiler link: clang -> /usr/bin/clang
===> Compiler link: clang++ -> /usr/bin/clang++
===> Compiler link: cc -> /usr/bin/cc
===> Compiler link: c++ -> /usr/bin/c++
>>> Running configure in databases/galera at 1791273838.74
===> databases/galera
===> Generating configure for galera-26.4.16
===> Configuring for galera-26.4.16
tar cf - -C /pobj/galera-26.4.16/wsrep-API-694d6ca47f5eec7873be99b7d6babccf633d1231 . | tar xf - -C /pobj/galera-26.4.16/galera-release_26.4.16/wsrep/src
-- CMake version 4.3.5
CMake Deprecation Warning at CMakeLists.txt:6 (cmake_minimum_required):
Compatibility with CMake < 3.10 will be removed from a future version of
CMake.
Update the VERSION argument <min> value. Or, use the <min>...<max> syntax
to tell CMake that the project requires at least <min> but has been updated
to work with policies introduced by <max> or earlier.
-- The C compiler identification is Clang 22.1.6
-- The CXX compiler identification is Clang 22.1.6
-- Detecting C compiler ABI info
-- Detecting C compiler ABI info - done
-- Check for working C compiler: /pobj/galera-26.4.16/bin/cc - skipped
-- Detecting C compile features
-- Detecting C compile features - done
-- Detecting CXX compiler ABI info
-- Detecting CXX compiler ABI info - done
-- Check for working CXX compiler: /pobj/galera-26.4.16/bin/c++ - skipped
-- Detecting CXX compile features
-- Detecting CXX compile features - done
CMake Deprecation Warning at CMakeLists.txt:61 (CMAKE_POLICY):
The OLD behavior for policy CMP0075 will be removed from a future version
of CMake.
The cmake-policies(7) manual explains that the OLD behaviors of all
policies are deprecated and that a policy should be set to OLD only under
specific short-term circumstances. Projects should be ported to the NEW
behavior and not rely on setting a policy to OLD.
-- Building Galera version: '4.16' revision: '' git revision: 'XXXX' wsrep-API version '26'
-- CMAKE_SYSTEM_NAME: OpenBSD
-- CMAKE_SYSTEM_PROCESSOR: i386
-- Galera system libs: pthread
-- Found PkgConfig: /usr/bin/pkg-config (found version "3.0.7")
-- Found OpenSSL: /usr/lib/libcrypto.so.57.2 (found version "2.0.0")
-- /usr/lib/libssl.so.60.2;/usr/lib/libcrypto.so.57.2
-- GALERA_SSL_LIBS: /usr/lib/libssl.so.60.2;/usr/lib/libcrypto.so.57.2
-- Performing Test ECDH_AUTO_OK
-- Performing Test ECDH_AUTO_OK - Success
-- Looking for C++ include asio.hpp
-- Looking for C++ include asio.hpp - found
-- Performing Test ASIO_VERSION_OK
-- Performing Test ASIO_VERSION_OK - Success
CMake Warning (dev) at cmake/boost.cmake:7 (find_package):
Policy CMP0167 is not set: The FindBoost module is removed. Run "cmake
--help-policy CMP0167" for policy details. Use the cmake_policy command to
set the policy and suppress this warning.
Call Stack (most recent call first):
CMakeLists.txt:87 (include)
This warning is for project developers. Use -Wno-dev to suppress it.
-- Found Boost: /usr/local/lib/cmake/Boost-1.91.0/BoostConfig.cmake (found suitable version "1.91.0", minimum required is "1.41") found components: program_options
-- Boost::program_options
-- Checking for hardware CRC support for i386
-- No hardware CRC support
-- Looking for endian.h
-- Looking for endian.h - found
-- Looking for sys/endian.h
-- Looking for sys/endian.h - found
-- Looking for sys/byteorder.h
-- Looking for sys/byteorder.h - not found
-- Looking for byteswap.h
-- Looking for byteswap.h - not found
-- Looking for C++ include boost/shared_ptr.hpp
-- Looking for C++ include boost/shared_ptr.hpp - found
-- Performing Test GALERA_CHECK_COMPILES
-- Performing Test GALERA_CHECK_COMPILES - Success
--
-- CMAKE_BUILD_TYPE: Release
-- COMPILE_DEFINITIONS: NDEBUG;HAVE_COMMON_H;GALERA_HAVE_SSL;OPENSSL_HAS_SET_ECDH_AUTO;HAVE_ASIO_HPP;HAVE_ASIO_HPP;HAVE_STD_ARRAY;BOOST_DATE_TIME_POSIX_TIME_STD_CONFIG=1;GU_CRC32C_NO_HARDWARE;HAVE_ENDIAN_H;HAVE_BOOST_SHARED_PTR_HPP;HAVE_STD_UNORDERED_MAP
-- CMAKE_C_FLAGS: -O2 -pipe -I/usr/local/include -Wall -Wextra -g
-- CMAKE_CXX_FLAGS: -O2 -pipe -I/usr/local/include -Wall -Wextra -Woverloaded-virtual -g
-- CMAKE_EXE_LINKER_FLAGS:
-- GALERA_SYSTEM_LIBS: pthread
-- GALERA_UNIT_TEST_LIBS: /usr/local/lib/libcheck.so.3.1;m;pthread
--
-- Configuring done (19.7s)
-- Generating done (0.4s)
CMake Warning:
Manually-specified variables were not used by the project:
CMAKE_ASM_COMPILER_AR
CMAKE_ASM_COMPILER_CLANG_SCAN_DEPS
CMAKE_ASM_COMPILER_RANLIB
CMAKE_Fortran_COMPILER_AR
CMAKE_Fortran_COMPILER_CLANG_SCAN_DEPS
CMAKE_Fortran_COMPILER_RANLIB
CMAKE_OBJCXX_COMPILER_AR
CMAKE_OBJCXX_COMPILER_CLANG_SCAN_DEPS
CMAKE_OBJCXX_COMPILER_RANLIB
CMAKE_OBJC_COMPILER_AR
CMAKE_OBJC_COMPILER_CLANG_SCAN_DEPS
CMAKE_OBJC_COMPILER_RANLIB
-- Build files have been written to: /pobj/galera-26.4.16/build-i386
>>> Running build in databases/galera at 1791273859.61
===> databases/galera
===> Building for galera-26.4.16
Change Dir: '/pobj/galera-26.4.16/build-i386'
Run Build Command(s): /usr/local/bin/ninja -v -j 1
[1/276] /pobj/galera-26.4.16/bin/cc -DBOOST_DATE_TIME_POSIX_TIME_STD_CONFIG=1 -DGALERA_HAVE_SSL -DGU_CRC32C_NO_HARDWARE -DHAVE_ASIO_HPP -DHAVE_BOOST_SHARED_PTR_HPP -DHAVE_COMMON_H -DHAVE_ENDIAN_H -DHAVE_STD_ARRAY -DHAVE_STD_UNORDERED_MAP -DNDEBUG -DOPENSSL_HAS_SET_ECDH_AUTO -I/pobj/galera-26.4.16/galera-release_26.4.16 -I/pobj/galera-26.4.16/galera-release_26.4.16/common -I/pobj/galera-26.4.16/galera-release_26.4.16/galera/src -I/pobj/galera-26.4.16/galera-release_26.4.16/galerautils/src -I/pobj/galera-26.4.16/galera-release_26.4.16/gcache/src -I/pobj/galera-26.4.16/galera-release_26.4.16/gcomm/src -I/pobj/galera-26.4.16/galera-release_26.4.16/gcs/src -I/pobj/galera-26.4.16/galera-release_26.4.16/wsrep/src -O2 -pipe -I/usr/local/include -Wall -Wextra -g -DNDEBUG -std=gnu99 -fPIC -Wno-unused-parameter -MD -MT galerautils/src/CMakeFiles/galerautils_log.dir/gu_log.c.o -MF galerautils/src/CMakeFiles/galerautils_log.dir/gu_log.c.o.d -o galerautils/src/CMakeFiles/galerautils_log.dir/gu_log.c.o -c /pobj/galera-26.4.16/galera-release_26.4.16/galerautils/src/gu_log.c
[2/276] : && /usr/local/bin/cmake -E rm -f galerautils/src/libgalerautils_log.a && /usr/bin/ar qc galerautils/src/libgalerautils_log.a galerautils/src/CMakeFiles/galerautils_log.dir/gu_log.c.o && /usr/bin/ranlib galerautils/src/libgalerautils_log.a && :
[3/276] /pobj/galera-26.4.16/bin/cc -DBOOST_DATE_TIME_POSIX_TIME_STD_CONFIG=1 -DGALERA_HAVE_SSL -DGU_CRC32C_NO_HARDWARE -DHAVE_ASIO_HPP -DHAVE_BOOST_SHARED_PTR_HPP -DHAVE_COMMON_H -DHAVE_ENDIAN_H -DHAVE_STD_ARRAY -DHAVE_STD_UNORDERED_MAP -DNDEBUG -DOPENSSL_HAS_SET_ECDH_AUTO -I/pobj/galera-26.4.16/galera-release_26.4.16 -I/pobj/galera-26.4.16/galera-release_26.4.16/common -I/pobj/galera-26.4.16/galera-release_26.4.16/galera/src -I/pobj/galera-26.4.16/galera-release_26.4.16/galerautils/src -I/pobj/galera-26.4.16/galera-release_26.4.16/gcache/src -I/pobj/galera-26.4.16/galera-release_26.4.16/gcomm/src -I/pobj/galera-26.4.16/galera-release_26.4.16/gcs/src -I/pobj/galera-26.4.16/galera-release_26.4.16/wsrep/src -O2 -pipe -I/usr/local/include -Wall -Wextra -g -DNDEBUG -std=gnu99 -fPIC -Wno-unused-parameter -Wno-declaration-after-statement -Wno-vla -MD -MT galerautils/src/CMakeFiles/galerautils.dir/gu_abort.c.o -MF galerautils/src/CMakeFiles/galerautils.dir/gu_abort.c.o.d -o galerautils/src/CMakeFiles/galerautils.dir/gu_abort.c.o -c /pobj/galera-26.4.16/galera-release_26.4.16/galerautils/src/gu_abort.c
[4/276] /pobj/galera-26.4.16/bin/cc -DBOOST_DATE_TIME_POSIX_TIME_STD_CONFIG=1 -DGALERA_HAVE_SSL -DGU_CRC32C_NO_HARDWARE -DHAVE_ASIO_HPP -DHAVE_BOOST_SHARED_PTR_HPP -DHAVE_COMMON_H -DHAVE_ENDIAN_H -DHAVE_STD_ARRAY -DHAVE_STD_UNORDERED_MAP -DNDEBUG -DOPENSSL_HAS_SET_ECDH_AUTO -I/pobj/galera-26.4.16/galera-release_26.4.16 -I/pobj/galera-26.4.16/galera-release_26.4.16/common -I/pobj/galera-26.4.16/galera-release_26.4.16/galera/src -I/pobj/galera-26.4.16/galera-release_26.4.16/galerautils/src -I/pobj/galera-26.4.16/galera-release_26.4.16/gcache/src -I/pobj/galera-26.4.16/galera-release_26.4.16/gcomm/src -I/pobj/galera-26.4.16/galera-release_26.4.16/gcs/src -I/pobj/galera-26.4.16/galera-release_26.4.16/wsrep/src -O2 -pipe -I/usr/local/include -Wall -Wextra -g -DNDEBUG -std=gnu99 -fPIC -Wno-unused-parameter -Wno-declaration-after-statement -Wno-vla -MD -MT galerautils/src/CMakeFiles/galerautils.dir/gu_crc32c.c.o -MF galerautils/src/CMakeFiles/galerautils.dir/gu_crc32c.c.o.d -o galerautils/src/CMakeFiles/galerautils.dir/gu_crc32c.c.o -c /pobj/galera-26.4.16/galera-release_26.4.16/galerautils/src/gu_crc32c.c
[5/276] /pobj/galera-26.4.16/bin/cc -DBOOST_DATE_TIME_POSIX_TIME_STD_CONFIG=1 -DGALERA_HAVE_SSL -DGU_CRC32C_NO_HARDWARE -DHAVE_ASIO_HPP -DHAVE_BOOST_SHARED_PTR_HPP -DHAVE_COMMON_H -DHAVE_ENDIAN_H -DHAVE_STD_ARRAY -DHAVE_STD_UNORDERED_MAP -DNDEBUG -DOPENSSL_HAS_SET_ECDH_AUTO -I/pobj/galera-26.4.16/galera-release_26.4.16 -I/pobj/galera-26.4.16/galera-release_26.4.16/common -I/pobj/galera-26.4.16/galera-release_26.4.16/galera/src -I/pobj/galera-26.4.16/galera-release_26.4.16/galerautils/src -I/pobj/galera-26.4.16/galera-release_26.4.16/gcache/src -I/pobj/galera-26.4.16/galera-release_26.4.16/gcomm/src -I/pobj/galera-26.4.16/galera-release_26.4.16/gcs/src -I/pobj/galera-26.4.16/galera-release_26.4.16/wsrep/src -O2 -pipe -I/usr/local/include -Wall -Wextra -g -DNDEBUG -std=gnu99 -fPIC -Wno-unused-parameter -Wno-declaration-after-statement -Wno-vla -MD -MT galerautils/src/CMakeFiles/galerautils.dir/gu_dbug.c.o -MF galerautils/src/CMakeFiles/galerautils.dir/gu_dbug.c.o.d -o galerautils/src/CMakeFiles/galerautils.dir/gu_dbug.c.o -c /pobj/galera-26.4.16/galera-release_26.4.16/galerautils/src/gu_dbug.c
[6/276] /pobj/galera-26.4.16/bin/cc -DBOOST_DATE_TIME_POSIX_TIME_STD_CONFIG=1 -DGALERA_HAVE_SSL -DGU_CRC32C_NO_HARDWARE -DHAVE_ASIO_HPP -DHAVE_BOOST_SHARED_PTR_HPP -DHAVE_COMMON_H -DHAVE_ENDIAN_H -DHAVE_STD_ARRAY -DHAVE_STD_UNORDERED_MAP -DNDEBUG -DOPENSSL_HAS_SET_ECDH_AUTO -I/pobj/galera-26.4.16/galera-release_26.4.16 -I/pobj/galera-26.4.16/galera-release_26.4.16/common -I/pobj/galera-26.4.16/galera-release_26.4.16/galera/src -I/pobj/galera-26.4.16/galera-release_26.4.16/galerautils/src -I/pobj/galera-26.4.16/galera-release_26.4.16/gcache/src -I/pobj/galera-26.4.16/galera-release_26.4.16/gcomm/src -I/pobj/galera-26.4.16/galera-release_26.4.16/gcs/src -I/pobj/galera-26.4.16/galera-release_26.4.16/wsrep/src -O2 -pipe -I/usr/local/include -Wall -Wextra -g -DNDEBUG -std=gnu99 -fPIC -Wno-unused-parameter -Wno-declaration-after-statement -Wno-vla -MD -MT galerautils/src/CMakeFiles/galerautils.dir/gu_fifo.c.o -MF galerautils/src/CMakeFiles/galerautils.dir/gu_fifo.c.o.d -o galerautils/src/CMakeFiles/galerautils.dir/gu_fifo.c.o -c /pobj/galera-26.4.16/galera-release_26.4.16/galerautils/src/gu_fifo.c
[7/276] /pobj/galera-26.4.16/bin/cc -DBOOST_DATE_TIME_POSIX_TIME_STD_CONFIG=1 -DGALERA_HAVE_SSL -DGU_CRC32C_NO_HARDWARE -DHAVE_ASIO_HPP -DHAVE_BOOST_SHARED_PTR_HPP -DHAVE_COMMON_H -DHAVE_ENDIAN_H -DHAVE_STD_ARRAY -DHAVE_STD_UNORDERED_MAP -DNDEBUG -DOPENSSL_HAS_SET_ECDH_AUTO -I/pobj/galera-26.4.16/galera-release_26.4.16 -I/pobj/galera-26.4.16/galera-release_26.4.16/common -I/pobj/galera-26.4.16/galera-release_26.4.16/galera/src -I/pobj/galera-26.4.16/galera-release_26.4.16/galerautils/src -I/pobj/galera-26.4.16/galera-release_26.4.16/gcache/src -I/pobj/galera-26.4.16/galera-release_26.4.16/gcomm/src -I/pobj/galera-26.4.16/galera-release_26.4.16/gcs/src -I/pobj/galera-26.4.16/galera-release_26.4.16/wsrep/src -O2 -pipe -I/usr/local/include -Wall -Wextra -g -DNDEBUG -std=gnu99 -fPIC -Wno-unused-parameter -Wno-declaration-after-statement -Wno-vla -MD -MT galerautils/src/CMakeFiles/galerautils.dir/gu_lock_step.c.o -MF galerautils/src/CMakeFiles/galerautils.dir/gu_lock_step.c.o.d -o galerautils/src/CMakeFiles/galerautils.dir/gu_lock_step.c.o -c /pobj/galera-26.4.16/galera-release_26.4.16/galerautils/src/gu_lock_step.c
[8/276] /pobj/galera-26.4.16/bin/cc -DBOOST_DATE_TIME_POSIX_TIME_STD_CONFIG=1 -DGALERA_HAVE_SSL -DGU_CRC32C_NO_HARDWARE -DHAVE_ASIO_HPP -DHAVE_BOOST_SHARED_PTR_HPP -DHAVE_COMMON_H -DHAVE_ENDIAN_H -DHAVE_STD_ARRAY -DHAVE_STD_UNORDERED_MAP -DNDEBUG -DOPENSSL_HAS_SET_ECDH_AUTO -I/pobj/galera-26.4.16/galera-release_26.4.16 -I/pobj/galera-26.4.16/galera-release_26.4.16/common -I/pobj/galera-26.4.16/galera-release_26.4.16/galera/src -I/pobj/galera-26.4.16/galera-release_26.4.16/galerautils/src -I/pobj/galera-26.4.16/galera-release_26.4.16/gcache/src -I/pobj/galera-26.4.16/galera-release_26.4.16/gcomm/src -I/pobj/galera-26.4.16/galera-release_26.4.16/gcs/src -I/pobj/galera-26.4.16/galera-release_26.4.16/wsrep/src -O2 -pipe -I/usr/local/include -Wall -Wextra -g -DNDEBUG -std=gnu99 -fPIC -Wno-unused-parameter -Wno-declaration-after-statement -Wno-vla -MD -MT galerautils/src/CMakeFiles/galerautils.dir/gu_mem.c.o -MF galerautils/src/CMakeFiles/galerautils.dir/gu_mem.c.o.d -o galerautils/src/CMakeFiles/galerautils.dir/gu_mem.c.o -c /pobj/galera-26.4.16/galera-release_26.4.16/galerautils/src/gu_mem.c
[9/276] /pobj/galera-26.4.16/bin/cc -DBOOST_DATE_TIME_POSIX_TIME_STD_CONFIG=1 -DGALERA_HAVE_SSL -DGU_CRC32C_NO_HARDWARE -DHAVE_ASIO_HPP -DHAVE_BOOST_SHARED_PTR_HPP -DHAVE_COMMON_H -DHAVE_ENDIAN_H -DHAVE_STD_ARRAY -DHAVE_STD_UNORDERED_MAP -DNDEBUG -DOPENSSL_HAS_SET_ECDH_AUTO -I/pobj/galera-26.4.16/galera-release_26.4.16 -I/pobj/galera-26.4.16/galera-release_26.4.16/common -I/pobj/galera-26.4.16/galera-release_26.4.16/galera/src -I/pobj/galera-26.4.16/galera-release_26.4.16/galerautils/src -I/pobj/galera-26.4.16/galera-release_26.4.16/gcache/src -I/pobj/galera-26.4.16/galera-release_26.4.16/gcomm/src -I/pobj/galera-26.4.16/galera-release_26.4.16/gcs/src -I/pobj/galera-26.4.16/galera-release_26.4.16/wsrep/src -O2 -pipe -I/usr/local/include -Wall -Wextra -g -DNDEBUG -std=gnu99 -fPIC -Wno-unused-parameter -Wno-declaration-after-statement -Wno-vla -MD -MT galerautils/src/CMakeFiles/galerautils.dir/gu_mmh3.c.o -MF galerautils/src/CMakeFiles/galerautils.dir/gu_mmh3.c.o.d -o galerautils/src/CMakeFiles/galerautils.dir/gu_mmh3.c.o -c /pobj/galera-26.4.16/galera-release_26.4.16/galerautils/src/gu_mmh3.c
[10/276] /pobj/galera-26.4.16/bin/cc -DBOOST_DATE_TIME_POSIX_TIME_STD_CONFIG=1 -DGALERA_HAVE_SSL -DGU_CRC32C_NO_HARDWARE -DHAVE_ASIO_HPP -DHAVE_BOOST_SHARED_PTR_HPP -DHAVE_COMMON_H -DHAVE_ENDIAN_H -DHAVE_STD_ARRAY -DHAVE_STD_UNORDERED_MAP -DNDEBUG -DOPENSSL_HAS_SET_ECDH_AUTO -I/pobj/galera-26.4.16/galera-release_26.4.16 -I/pobj/galera-26.4.16/galera-release_26.4.16/common -I/pobj/galera-26.4.16/galera-release_26.4.16/galera/src -I/pobj/galera-26.4.16/galera-release_26.4.16/galerautils/src -I/pobj/galera-26.4.16/galera-release_26.4.16/gcache/src -I/pobj/galera-26.4.16/galera-release_26.4.16/gcomm/src -I/pobj/galera-26.4.16/galera-release_26.4.16/gcs/src -I/pobj/galera-26.4.16/galera-release_26.4.16/wsrep/src -O2 -pipe -I/usr/local/include -Wall -Wextra -g -DNDEBUG -std=gnu99 -fPIC -Wno-unused-parameter -Wno-declaration-after-statement -Wno-vla -MD -MT galerautils/src/CMakeFiles/galerautils.dir/gu_spooky.c.o -MF galerautils/src/CMakeFiles/galerautils.dir/gu_spooky.c.o.d -o galerautils/src/CMakeFiles/galerautils.dir/gu_spooky.c.o -c /pobj/galera-26.4.16/galera-release_26.4.16/galerautils/src/gu_spooky.c
[11/276] /pobj/galera-26.4.16/bin/cc -DBOOST_DATE_TIME_POSIX_TIME_STD_CONFIG=1 -DGALERA_HAVE_SSL -DGU_CRC32C_NO_HARDWARE -DHAVE_ASIO_HPP -DHAVE_BOOST_SHARED_PTR_HPP -DHAVE_COMMON_H -DHAVE_ENDIAN_H -DHAVE_STD_ARRAY -DHAVE_STD_UNORDERED_MAP -DNDEBUG -DOPENSSL_HAS_SET_ECDH_AUTO -I/pobj/galera-26.4.16/galera-release_26.4.16 -I/pobj/galera-26.4.16/galera-release_26.4.16/common -I/pobj/galera-26.4.16/galera-release_26.4.16/galera/src -I/pobj/galera-26.4.16/galera-release_26.4.16/galerautils/src -I/pobj/galera-26.4.16/galera-release_26.4.16/gcache/src -I/pobj/galera-26.4.16/galera-release_26.4.16/gcomm/src -I/pobj/galera-26.4.16/galera-release_26.4.16/gcs/src -I/pobj/galera-26.4.16/galera-release_26.4.16/wsrep/src -O2 -pipe -I/usr/local/include -Wall -Wextra -g -DNDEBUG -std=gnu99 -fPIC -Wno-unused-parameter -Wno-declaration-after-statement -Wno-vla -MD -MT galerautils/src/CMakeFiles/galerautils.dir/gu_rand.c.o -MF galerautils/src/CMakeFiles/galerautils.dir/gu_rand.c.o.d -o galerautils/src/CMakeFiles/galerautils.dir/gu_rand.c.o -c /pobj/galera-26.4.16/galera-release_26.4.16/galerautils/src/gu_rand.c
[12/276] /pobj/galera-26.4.16/bin/cc -DBOOST_DATE_TIME_POSIX_TIME_STD_CONFIG=1 -DGALERA_HAVE_SSL -DGU_CRC32C_NO_HARDWARE -DHAVE_ASIO_HPP -DHAVE_BOOST_SHARED_PTR_HPP -DHAVE_COMMON_H -DHAVE_ENDIAN_H -DHAVE_STD_ARRAY -DHAVE_STD_UNORDERED_MAP -DNDEBUG -DOPENSSL_HAS_SET_ECDH_AUTO -I/pobj/galera-26.4.16/galera-release_26.4.16 -I/pobj/galera-26.4.16/galera-release_26.4.16/common -I/pobj/galera-26.4.16/galera-release_26.4.16/galera/src -I/pobj/galera-26.4.16/galera-release_26.4.16/galerautils/src -I/pobj/galera-26.4.16/galera-release_26.4.16/gcache/src -I/pobj/galera-26.4.16/galera-release_26.4.16/gcomm/src -I/pobj/galera-26.4.16/galera-release_26.4.16/gcs/src -I/pobj/galera-26.4.16/galera-release_26.4.16/wsrep/src -O2 -pipe -I/usr/local/include -Wall -Wextra -g -DNDEBUG -std=gnu99 -fPIC -Wno-unused-parameter -Wno-declaration-after-statement -Wno-vla -MD -MT galerautils/src/CMakeFiles/galerautils.dir/gu_threads.c.o -MF galerautils/src/CMakeFiles/galerautils.dir/gu_threads.c.o.d -o galerautils/src/CMakeFiles/galerautils.dir/gu_threads.c.o -c /pobj/galera-26.4.16/galera-release_26.4.16/galerautils/src/gu_threads.c
[13/276] /pobj/galera-26.4.16/bin/cc -DBOOST_DATE_TIME_POSIX_TIME_STD_CONFIG=1 -DGALERA_HAVE_SSL -DGU_CRC32C_NO_HARDWARE -DHAVE_ASIO_HPP -DHAVE_BOOST_SHARED_PTR_HPP -DHAVE_COMMON_H -DHAVE_ENDIAN_H -DHAVE_STD_ARRAY -DHAVE_STD_UNORDERED_MAP -DNDEBUG -DOPENSSL_HAS_SET_ECDH_AUTO -I/pobj/galera-26.4.16/galera-release_26.4.16 -I/pobj/galera-26.4.16/galera-release_26.4.16/common -I/pobj/galera-26.4.16/galera-release_26.4.16/galera/src -I/pobj/galera-26.4.16/galera-release_26.4.16/galerautils/src -I/pobj/galera-26.4.16/galera-release_26.4.16/gcache/src -I/pobj/galera-26.4.16/galera-release_26.4.16/gcomm/src -I/pobj/galera-26.4.16/galera-release_26.4.16/gcs/src -I/pobj/galera-26.4.16/galera-release_26.4.16/wsrep/src -O2 -pipe -I/usr/local/include -Wall -Wextra -g -DNDEBUG -std=gnu99 -fPIC -Wno-unused-parameter -Wno-declaration-after-statement -Wno-vla -MD -MT galerautils/src/CMakeFiles/galerautils.dir/gu_hexdump.c.o -MF galerautils/src/CMakeFiles/galerautils.dir/gu_hexdump.c.o.d -o galerautils/src/CMakeFiles/galerautils.dir/gu_hexdump.c.o -c /pobj/galera-26.4.16/galera-release_26.4.16/galerautils/src/gu_hexdump.c
[14/276] /pobj/galera-26.4.16/bin/cc -DBOOST_DATE_TIME_POSIX_TIME_STD_CONFIG=1 -DGALERA_HAVE_SSL -DGU_CRC32C_NO_HARDWARE -DHAVE_ASIO_HPP -DHAVE_BOOST_SHARED_PTR_HPP -DHAVE_COMMON_H -DHAVE_ENDIAN_H -DHAVE_STD_ARRAY -DHAVE_STD_UNORDERED_MAP -DNDEBUG -DOPENSSL_HAS_SET_ECDH_AUTO -I/pobj/galera-26.4.16/galera-release_26.4.16 -I/pobj/galera-26.4.16/galera-release_26.4.16/common -I/pobj/galera-26.4.16/galera-release_26.4.16/galera/src -I/pobj/galera-26.4.16/galera-release_26.4.16/galerautils/src -I/pobj/galera-26.4.16/galera-release_26.4.16/gcache/src -I/pobj/galera-26.4.16/galera-release_26.4.16/gcomm/src -I/pobj/galera-26.4.16/galera-release_26.4.16/gcs/src -I/pobj/galera-26.4.16/galera-release_26.4.16/wsrep/src -O2 -pipe -I/usr/local/include -Wall -Wextra -g -DNDEBUG -std=gnu99 -fPIC -Wno-unused-parameter -Wno-declaration-after-statement -Wno-vla -MD -MT galerautils/src/CMakeFiles/galerautils.dir/gu_to.c.o -MF galerautils/src/CMakeFiles/galerautils.dir/gu_to.c.o.d -o galerautils/src/CMakeFiles/galerautils.dir/gu_to.c.o -c /pobj/galera-26.4.16/galera-release_26.4.16/galerautils/src/gu_to.c
[15/276] /pobj/galera-26.4.16/bin/cc -DBOOST_DATE_TIME_POSIX_TIME_STD_CONFIG=1 -DGALERA_HAVE_SSL -DGU_CRC32C_NO_HARDWARE -DHAVE_ASIO_HPP -DHAVE_BOOST_SHARED_PTR_HPP -DHAVE_COMMON_H -DHAVE_ENDIAN_H -DHAVE_STD_ARRAY -DHAVE_STD_UNORDERED_MAP -DNDEBUG -DOPENSSL_HAS_SET_ECDH_AUTO -I/pobj/galera-26.4.16/galera-release_26.4.16 -I/pobj/galera-26.4.16/galera-release_26.4.16/common -I/pobj/galera-26.4.16/galera-release_26.4.16/galera/src -I/pobj/galera-26.4.16/galera-release_26.4.16/galerautils/src -I/pobj/galera-26.4.16/galera-release_26.4.16/gcache/src -I/pobj/galera-26.4.16/galera-release_26.4.16/gcomm/src -I/pobj/galera-26.4.16/galera-release_26.4.16/gcs/src -I/pobj/galera-26.4.16/galera-release_26.4.16/wsrep/src -O2 -pipe -I/usr/local/include -Wall -Wextra -g -DNDEBUG -std=gnu99 -fPIC -Wno-unused-parameter -Wno-declaration-after-statement -Wno-vla -MD -MT galerautils/src/CMakeFiles/galerautils.dir/gu_utils.c.o -MF galerautils/src/CMakeFiles/galerautils.dir/gu_utils.c.o.d -o galerautils/src/CMakeFiles/galerautils.dir/gu_utils.c.o -c /pobj/galera-26.4.16/galera-release_26.4.16/galerautils/src/gu_utils.c
[16/276] /pobj/galera-26.4.16/bin/cc -DBOOST_DATE_TIME_POSIX_TIME_STD_CONFIG=1 -DGALERA_HAVE_SSL -DGU_CRC32C_NO_HARDWARE -DHAVE_ASIO_HPP -DHAVE_BOOST_SHARED_PTR_HPP -DHAVE_COMMON_H -DHAVE_ENDIAN_H -DHAVE_STD_ARRAY -DHAVE_STD_UNORDERED_MAP -DNDEBUG -DOPENSSL_HAS_SET_ECDH_AUTO -I/pobj/galera-26.4.16/galera-release_26.4.16 -I/pobj/galera-26.4.16/galera-release_26.4.16/common -I/pobj/galera-26.4.16/galera-release_26.4.16/galera/src -I/pobj/galera-26.4.16/galera-release_26.4.16/galerautils/src -I/pobj/galera-26.4.16/galera-release_26.4.16/gcache/src -I/pobj/galera-26.4.16/galera-release_26.4.16/gcomm/src -I/pobj/galera-26.4.16/galera-release_26.4.16/gcs/src -I/pobj/galera-26.4.16/galera-release_26.4.16/wsrep/src -O2 -pipe -I/usr/local/include -Wall -Wextra -g -DNDEBUG -std=gnu99 -fPIC -Wno-unused-parameter -Wno-declaration-after-statement -Wno-vla -MD -MT galerautils/src/CMakeFiles/galerautils.dir/gu_uuid.c.o -MF galerautils/src/CMakeFiles/galerautils.dir/gu_uuid.c.o.d -o galerautils/src/CMakeFiles/galerautils.dir/gu_uuid.c.o -c /pobj/galera-26.4.16/galera-release_26.4.16/galerautils/src/gu_uuid.c
[17/276] /pobj/galera-26.4.16/bin/cc -DBOOST_DATE_TIME_POSIX_TIME_STD_CONFIG=1 -DGALERA_HAVE_SSL -DGU_CRC32C_NO_HARDWARE -DHAVE_ASIO_HPP -DHAVE_BOOST_SHARED_PTR_HPP -DHAVE_COMMON_H -DHAVE_ENDIAN_H -DHAVE_STD_ARRAY -DHAVE_STD_UNORDERED_MAP -DNDEBUG -DOPENSSL_HAS_SET_ECDH_AUTO -I/pobj/galera-26.4.16/galera-release_26.4.16 -I/pobj/galera-26.4.16/galera-release_26.4.16/common -I/pobj/galera-26.4.16/galera-release_26.4.16/galera/src -I/pobj/galera-26.4.16/galera-release_26.4.16/galerautils/src -I/pobj/galera-26.4.16/galera-release_26.4.16/gcache/src -I/pobj/galera-26.4.16/galera-release_26.4.16/gcomm/src -I/pobj/galera-26.4.16/galera-release_26.4.16/gcs/src -I/pobj/galera-26.4.16/galera-release_26.4.16/wsrep/src -O2 -pipe -I/usr/local/include -Wall -Wextra -g -DNDEBUG -std=gnu99 -fPIC -Wno-unused-parameter -Wno-declaration-after-statement -Wno-vla -MD -MT galerautils/src/CMakeFiles/galerautils.dir/gu_backtrace.c.o -MF galerautils/src/CMakeFiles/galerautils.dir/gu_backtrace.c.o.d -o galerautils/src/CMakeFiles/galerautils.dir/gu_backtrace.c.o -c /pobj/galera-26.4.16/galera-release_26.4.16/galerautils/src/gu_backtrace.c
[18/276] /pobj/galera-26.4.16/bin/cc -DBOOST_DATE_TIME_POSIX_TIME_STD_CONFIG=1 -DGALERA_HAVE_SSL -DGU_CRC32C_NO_HARDWARE -DHAVE_ASIO_HPP -DHAVE_BOOST_SHARED_PTR_HPP -DHAVE_COMMON_H -DHAVE_ENDIAN_H -DHAVE_STD_ARRAY -DHAVE_STD_UNORDERED_MAP -DNDEBUG -DOPENSSL_HAS_SET_ECDH_AUTO -I/pobj/galera-26.4.16/galera-release_26.4.16 -I/pobj/galera-26.4.16/galera-release_26.4.16/common -I/pobj/galera-26.4.16/galera-release_26.4.16/galera/src -I/pobj/galera-26.4.16/galera-release_26.4.16/galerautils/src -I/pobj/galera-26.4.16/galera-release_26.4.16/gcache/src -I/pobj/galera-26.4.16/galera-release_26.4.16/gcomm/src -I/pobj/galera-26.4.16/galera-release_26.4.16/gcs/src -I/pobj/galera-26.4.16/galera-release_26.4.16/wsrep/src -O2 -pipe -I/usr/local/include -Wall -Wextra -g -DNDEBUG -std=gnu99 -fPIC -Wno-unused-parameter -Wno-declaration-after-statement -Wno-vla -MD -MT galerautils/src/CMakeFiles/galerautils.dir/gu_limits.c.o -MF galerautils/src/CMakeFiles/galerautils.dir/gu_limits.c.o.d -o galerautils/src/CMakeFiles/galerautils.dir/gu_limits.c.o -c /pobj/galera-26.4.16/galera-release_26.4.16/galerautils/src/gu_limits.c
[19/276] /pobj/galera-26.4.16/bin/cc -DBOOST_DATE_TIME_POSIX_TIME_STD_CONFIG=1 -DGALERA_HAVE_SSL -DGU_CRC32C_NO_HARDWARE -DHAVE_ASIO_HPP -DHAVE_BOOST_SHARED_PTR_HPP -DHAVE_COMMON_H -DHAVE_ENDIAN_H -DHAVE_STD_ARRAY -DHAVE_STD_UNORDERED_MAP -DNDEBUG -DOPENSSL_HAS_SET_ECDH_AUTO -I/pobj/galera-26.4.16/galera-release_26.4.16 -I/pobj/galera-26.4.16/galera-release_26.4.16/common -I/pobj/galera-26.4.16/galera-release_26.4.16/galera/src -I/pobj/galera-26.4.16/galera-release_26.4.16/galerautils/src -I/pobj/galera-26.4.16/galera-release_26.4.16/gcache/src -I/pobj/galera-26.4.16/galera-release_26.4.16/gcomm/src -I/pobj/galera-26.4.16/galera-release_26.4.16/gcs/src -I/pobj/galera-26.4.16/galera-release_26.4.16/wsrep/src -O2 -pipe -I/usr/local/include -Wall -Wextra -g -DNDEBUG -std=gnu99 -fPIC -Wno-unused-parameter -Wno-declaration-after-statement -Wno-vla -MD -MT galerautils/src/CMakeFiles/galerautils.dir/gu_time.c.o -MF galerautils/src/CMakeFiles/galerautils.dir/gu_time.c.o.d -o galerautils/src/CMakeFiles/galerautils.dir/gu_time.c.o -c /pobj/galera-26.4.16/galera-release_26.4.16/galerautils/src/gu_time.c
[20/276] /pobj/galera-26.4.16/bin/cc -DBOOST_DATE_TIME_POSIX_TIME_STD_CONFIG=1 -DGALERA_HAVE_SSL -DGU_CRC32C_NO_HARDWARE -DHAVE_ASIO_HPP -DHAVE_BOOST_SHARED_PTR_HPP -DHAVE_COMMON_H -DHAVE_ENDIAN_H -DHAVE_STD_ARRAY -DHAVE_STD_UNORDERED_MAP -DNDEBUG -DOPENSSL_HAS_SET_ECDH_AUTO -I/pobj/galera-26.4.16/galera-release_26.4.16 -I/pobj/galera-26.4.16/galera-release_26.4.16/common -I/pobj/galera-26.4.16/galera-release_26.4.16/galera/src -I/pobj/galera-26.4.16/galera-release_26.4.16/galerautils/src -I/pobj/galera-26.4.16/galera-release_26.4.16/gcache/src -I/pobj/galera-26.4.16/galera-release_26.4.16/gcomm/src -I/pobj/galera-26.4.16/galera-release_26.4.16/gcs/src -I/pobj/galera-26.4.16/galera-release_26.4.16/wsrep/src -O2 -pipe -I/usr/local/include -Wall -Wextra -g -DNDEBUG -std=gnu99 -fPIC -Wno-unused-parameter -Wno-declaration-after-statement -Wno-vla -MD -MT galerautils/src/CMakeFiles/galerautils.dir/gu_init.c.o -MF galerautils/src/CMakeFiles/galerautils.dir/gu_init.c.o.d -o galerautils/src/CMakeFiles/galerautils.dir/gu_init.c.o -c /pobj/galera-26.4.16/galera-release_26.4.16/galerautils/src/gu_init.c
[21/276] : && /usr/local/bin/cmake -E rm -f galerautils/src/libgalerautils.a && /usr/bin/ar qc galerautils/src/libgalerautils.a galerautils/src/CMakeFiles/galerautils.dir/gu_abort.c.o galerautils/src/CMakeFiles/galerautils.dir/gu_crc32c.c.o galerautils/src/CMakeFiles/galerautils.dir/gu_dbug.c.o galerautils/src/CMakeFiles/galerautils.dir/gu_fifo.c.o galerautils/src/CMakeFiles/galerautils.dir/gu_lock_step.c.o galerautils/src/CMakeFiles/galerautils.dir/gu_mem.c.o galerautils/src/CMakeFiles/galerautils.dir/gu_mmh3.c.o galerautils/src/CMakeFiles/galerautils.dir/gu_spooky.c.o galerautils/src/CMakeFiles/galerautils.dir/gu_rand.c.o galerautils/src/CMakeFiles/galerautils.dir/gu_threads.c.o galerautils/src/CMakeFiles/galerautils.dir/gu_hexdump.c.o galerautils/src/CMakeFiles/galerautils.dir/gu_to.c.o galerautils/src/CMakeFiles/galerautils.dir/gu_utils.c.o galerautils/src/CMakeFiles/galerautils.dir/gu_uuid.c.o galerautils/src/CMakeFiles/galerautils.dir/gu_backtrace.c.o galerautils/src/CMakeFiles/galerautils.dir/gu_limits.c.o galerautils/src/CMakeFiles/galerautils.dir/gu_time.c.o galerautils/src/CMakeFiles/galerautils.dir/gu_init.c.o && /usr/bin/ranlib galerautils/src/libgalerautils.a && :
[22/276] /pobj/galera-26.4.16/bin/c++ -DBOOST_DATE_TIME_POSIX_TIME_STD_CONFIG=1 -DGALERA_HAVE_SSL -DGU_CRC32C_NO_HARDWARE -DHAVE_ASIO_HPP -DHAVE_BOOST_SHARED_PTR_HPP -DHAVE_COMMON_H -DHAVE_ENDIAN_H -DHAVE_STD_ARRAY -DHAVE_STD_UNORDERED_MAP -DNDEBUG -DOPENSSL_HAS_SET_ECDH_AUTO -I/pobj/galera-26.4.16/galera-release_26.4.16 -I/pobj/galera-26.4.16/galera-release_26.4.16/common -I/pobj/galera-26.4.16/galera-release_26.4.16/galera/src -I/pobj/galera-26.4.16/galera-release_26.4.16/galerautils/src -I/pobj/galera-26.4.16/galera-release_26.4.16/gcache/src -I/pobj/galera-26.4.16/galera-release_26.4.16/gcomm/src -I/pobj/galera-26.4.16/galera-release_26.4.16/gcs/src -I/pobj/galera-26.4.16/galera-release_26.4.16/wsrep/src -O2 -pipe -I/usr/local/include -Wall -Wextra -Woverloaded-virtual -g -DNDEBUG -std=gnu++11 -fPIC -Wno-conversion -Wno-unused-parameter -MD -MT galerautils/src/CMakeFiles/galerautilsxx.dir/gu_vlq.cpp.o -MF galerautils/src/CMakeFiles/galerautilsxx.dir/gu_vlq.cpp.o.d -o galerautils/src/CMakeFiles/galerautilsxx.dir/gu_vlq.cpp.o -c /pobj/galera-26.4.16/galera-release_26.4.16/galerautils/src/gu_vlq.cpp
[23/276] /pobj/galera-26.4.16/bin/c++ -DBOOST_DATE_TIME_POSIX_TIME_STD_CONFIG=1 -DGALERA_HAVE_SSL -DGU_CRC32C_NO_HARDWARE -DHAVE_ASIO_HPP -DHAVE_BOOST_SHARED_PTR_HPP -DHAVE_COMMON_H -DHAVE_ENDIAN_H -DHAVE_STD_ARRAY -DHAVE_STD_UNORDERED_MAP -DNDEBUG -DOPENSSL_HAS_SET_ECDH_AUTO -I/pobj/galera-26.4.16/galera-release_26.4.16 -I/pobj/galera-26.4.16/galera-release_26.4.16/common -I/pobj/galera-26.4.16/galera-release_26.4.16/galera/src -I/pobj/galera-26.4.16/galera-release_26.4.16/galerautils/src -I/pobj/galera-26.4.16/galera-release_26.4.16/gcache/src -I/pobj/galera-26.4.16/galera-release_26.4.16/gcomm/src -I/pobj/galera-26.4.16/galera-release_26.4.16/gcs/src -I/pobj/galera-26.4.16/galera-release_26.4.16/wsrep/src -O2 -pipe -I/usr/local/include -Wall -Wextra -Woverloaded-virtual -g -DNDEBUG -std=gnu++11 -fPIC -Wno-conversion -Wno-unused-parameter -MD -MT galerautils/src/CMakeFiles/galerautilsxx.dir/gu_datetime.cpp.o -MF galerautils/src/CMakeFiles/galerautilsxx.dir/gu_datetime.cpp.o.d -o galerautils/src/CMakeFiles/galerautilsxx.dir/gu_datetime.cpp.o -c /pobj/galera-26.4.16/galera-release_26.4.16/galerautils/src/gu_datetime.cpp
[24/276] /pobj/galera-26.4.16/bin/c++ -DBOOST_DATE_TIME_POSIX_TIME_STD_CONFIG=1 -DGALERA_HAVE_SSL -DGU_CRC32C_NO_HARDWARE -DHAVE_ASIO_HPP -DHAVE_BOOST_SHARED_PTR_HPP -DHAVE_COMMON_H -DHAVE_ENDIAN_H -DHAVE_STD_ARRAY -DHAVE_STD_UNORDERED_MAP -DNDEBUG -DOPENSSL_HAS_SET_ECDH_AUTO -I/pobj/galera-26.4.16/galera-release_26.4.16 -I/pobj/galera-26.4.16/galera-release_26.4.16/common -I/pobj/galera-26.4.16/galera-release_26.4.16/galera/src -I/pobj/galera-26.4.16/galera-release_26.4.16/galerautils/src -I/pobj/galera-26.4.16/galera-release_26.4.16/gcache/src -I/pobj/galera-26.4.16/galera-release_26.4.16/gcomm/src -I/pobj/galera-26.4.16/galera-release_26.4.16/gcs/src -I/pobj/galera-26.4.16/galera-release_26.4.16/wsrep/src -O2 -pipe -I/usr/local/include -Wall -Wextra -Woverloaded-virtual -g -DNDEBUG -std=gnu++11 -fPIC -Wno-conversion -Wno-unused-parameter -MD -MT galerautils/src/CMakeFiles/galerautilsxx.dir/gu_gtid.cpp.o -MF galerautils/src/CMakeFiles/galerautilsxx.dir/gu_gtid.cpp.o.d -o galerautils/src/CMakeFiles/galerautilsxx.dir/gu_gtid.cpp.o -c /pobj/galera-26.4.16/galera-release_26.4.16/galerautils/src/gu_gtid.cpp
[25/276] /pobj/galera-26.4.16/bin/c++ -DBOOST_DATE_TIME_POSIX_TIME_STD_CONFIG=1 -DGALERA_HAVE_SSL -DGU_CRC32C_NO_HARDWARE -DHAVE_ASIO_HPP -DHAVE_BOOST_SHARED_PTR_HPP -DHAVE_COMMON_H -DHAVE_ENDIAN_H -DHAVE_STD_ARRAY -DHAVE_STD_UNORDERED_MAP -DNDEBUG -DOPENSSL_HAS_SET_ECDH_AUTO -I/pobj/galera-26.4.16/galera-release_26.4.16 -I/pobj/galera-26.4.16/galera-release_26.4.16/common -I/pobj/galera-26.4.16/galera-release_26.4.16/galera/src -I/pobj/galera-26.4.16/galera-release_26.4.16/galerautils/src -I/pobj/galera-26.4.16/galera-release_26.4.16/gcache/src -I/pobj/galera-26.4.16/galera-release_26.4.16/gcomm/src -I/pobj/galera-26.4.16/galera-release_26.4.16/gcs/src -I/pobj/galera-26.4.16/galera-release_26.4.16/wsrep/src -O2 -pipe -I/usr/local/include -Wall -Wextra -Woverloaded-virtual -g -DNDEBUG -std=gnu++11 -fPIC -Wno-conversion -Wno-unused-parameter -MD -MT galerautils/src/CMakeFiles/galerautilsxx.dir/gu_event_service.cpp.o -MF galerautils/src/CMakeFiles/galerautilsxx.dir/gu_event_service.cpp.o.d -o galerautils/src/CMakeFiles/galerautilsxx.dir/gu_event_service.cpp.o -c /pobj/galera-26.4.16/galera-release_26.4.16/galerautils/src/gu_event_service.cpp
[26/276] /pobj/galera-26.4.16/bin/c++ -DBOOST_DATE_TIME_POSIX_TIME_STD_CONFIG=1 -DGALERA_HAVE_SSL -DGU_CRC32C_NO_HARDWARE -DHAVE_ASIO_HPP -DHAVE_BOOST_SHARED_PTR_HPP -DHAVE_COMMON_H -DHAVE_ENDIAN_H -DHAVE_STD_ARRAY -DHAVE_STD_UNORDERED_MAP -DNDEBUG -DOPENSSL_HAS_SET_ECDH_AUTO -I/pobj/galera-26.4.16/galera-release_26.4.16 -I/pobj/galera-26.4.16/galera-release_26.4.16/common -I/pobj/galera-26.4.16/galera-release_26.4.16/galera/src -I/pobj/galera-26.4.16/galera-release_26.4.16/galerautils/src -I/pobj/galera-26.4.16/galera-release_26.4.16/gcache/src -I/pobj/galera-26.4.16/galera-release_26.4.16/gcomm/src -I/pobj/galera-26.4.16/galera-release_26.4.16/gcs/src -I/pobj/galera-26.4.16/galera-release_26.4.16/wsrep/src -O2 -pipe -I/usr/local/include -Wall -Wextra -Woverloaded-virtual -g -DNDEBUG -std=gnu++11 -fPIC -Wno-conversion -Wno-unused-parameter -MD -MT galerautils/src/CMakeFiles/galerautilsxx.dir/gu_exception.cpp.o -MF galerautils/src/CMakeFiles/galerautilsxx.dir/gu_exception.cpp.o.d -o galerautils/src/CMakeFiles/galerautilsxx.dir/gu_exception.cpp.o -c /pobj/galera-26.4.16/galera-release_26.4.16/galerautils/src/gu_exception.cpp
[27/276] /pobj/galera-26.4.16/bin/c++ -DBOOST_DATE_TIME_POSIX_TIME_STD_CONFIG=1 -DGALERA_HAVE_SSL -DGU_CRC32C_NO_HARDWARE -DHAVE_ASIO_HPP -DHAVE_BOOST_SHARED_PTR_HPP -DHAVE_COMMON_H -DHAVE_ENDIAN_H -DHAVE_STD_ARRAY -DHAVE_STD_UNORDERED_MAP -DNDEBUG -DOPENSSL_HAS_SET_ECDH_AUTO -I/pobj/galera-26.4.16/galera-release_26.4.16 -I/pobj/galera-26.4.16/galera-release_26.4.16/common -I/pobj/galera-26.4.16/galera-release_26.4.16/galera/src -I/pobj/galera-26.4.16/galera-release_26.4.16/galerautils/src -I/pobj/galera-26.4.16/galera-release_26.4.16/gcache/src -I/pobj/galera-26.4.16/galera-release_26.4.16/gcomm/src -I/pobj/galera-26.4.16/galera-release_26.4.16/gcs/src -I/pobj/galera-26.4.16/galera-release_26.4.16/wsrep/src -O2 -pipe -I/usr/local/include -Wall -Wextra -Woverloaded-virtual -g -DNDEBUG -std=gnu++11 -fPIC -Wno-conversion -Wno-unused-parameter -MD -MT galerautils/src/CMakeFiles/galerautilsxx.dir/gu_hexdump.cpp.o -MF galerautils/src/CMakeFiles/galerautilsxx.dir/gu_hexdump.cpp.o.d -o galerautils/src/CMakeFiles/galerautilsxx.dir/gu_hexdump.cpp.o -c /pobj/galera-26.4.16/galera-release_26.4.16/galerautils/src/gu_hexdump.cpp
[28/276] /pobj/galera-26.4.16/bin/c++ -DBOOST_DATE_TIME_POSIX_TIME_STD_CONFIG=1 -DGALERA_HAVE_SSL -DGU_CRC32C_NO_HARDWARE -DHAVE_ASIO_HPP -DHAVE_BOOST_SHARED_PTR_HPP -DHAVE_COMMON_H -DHAVE_ENDIAN_H -DHAVE_STD_ARRAY -DHAVE_STD_UNORDERED_MAP -DNDEBUG -DOPENSSL_HAS_SET_ECDH_AUTO -I/pobj/galera-26.4.16/galera-release_26.4.16 -I/pobj/galera-26.4.16/galera-release_26.4.16/common -I/pobj/galera-26.4.16/galera-release_26.4.16/galera/src -I/pobj/galera-26.4.16/galera-release_26.4.16/galerautils/src -I/pobj/galera-26.4.16/galera-release_26.4.16/gcache/src -I/pobj/galera-26.4.16/galera-release_26.4.16/gcomm/src -I/pobj/galera-26.4.16/galera-release_26.4.16/gcs/src -I/pobj/galera-26.4.16/galera-release_26.4.16/wsrep/src -O2 -pipe -I/usr/local/include -Wall -Wextra -Woverloaded-virtual -g -DNDEBUG -std=gnu++11 -fPIC -Wno-conversion -Wno-unused-parameter -MD -MT galerautils/src/CMakeFiles/galerautilsxx.dir/gu_serialize.cpp.o -MF galerautils/src/CMakeFiles/galerautilsxx.dir/gu_serialize.cpp.o.d -o galerautils/src/CMakeFiles/galerautilsxx.dir/gu_serialize.cpp.o -c /pobj/galera-26.4.16/galera-release_26.4.16/galerautils/src/gu_serialize.cpp
[29/276] /pobj/galera-26.4.16/bin/c++ -DBOOST_DATE_TIME_POSIX_TIME_STD_CONFIG=1 -DGALERA_HAVE_SSL -DGU_CRC32C_NO_HARDWARE -DHAVE_ASIO_HPP -DHAVE_BOOST_SHARED_PTR_HPP -DHAVE_COMMON_H -DHAVE_ENDIAN_H -DHAVE_STD_ARRAY -DHAVE_STD_UNORDERED_MAP -DNDEBUG -DOPENSSL_HAS_SET_ECDH_AUTO -I/pobj/galera-26.4.16/galera-release_26.4.16 -I/pobj/galera-26.4.16/galera-release_26.4.16/common -I/pobj/galera-26.4.16/galera-release_26.4.16/galera/src -I/pobj/galera-26.4.16/galera-release_26.4.16/galerautils/src -I/pobj/galera-26.4.16/galera-release_26.4.16/gcache/src -I/pobj/galera-26.4.16/galera-release_26.4.16/gcomm/src -I/pobj/galera-26.4.16/galera-release_26.4.16/gcs/src -I/pobj/galera-26.4.16/galera-release_26.4.16/wsrep/src -O2 -pipe -I/usr/local/include -Wall -Wextra -Woverloaded-virtual -g -DNDEBUG -std=gnu++11 -fPIC -Wno-conversion -Wno-unused-parameter -MD -MT galerautils/src/CMakeFiles/galerautilsxx.dir/gu_logger.cpp.o -MF galerautils/src/CMakeFiles/galerautilsxx.dir/gu_logger.cpp.o.d -o galerautils/src/CMakeFiles/galerautilsxx.dir/gu_logger.cpp.o -c /pobj/galera-26.4.16/galera-release_26.4.16/galerautils/src/gu_logger.cpp
[30/276] /pobj/galera-26.4.16/bin/c++ -DBOOST_DATE_TIME_POSIX_TIME_STD_CONFIG=1 -DGALERA_HAVE_SSL -DGU_CRC32C_NO_HARDWARE -DHAVE_ASIO_HPP -DHAVE_BOOST_SHARED_PTR_HPP -DHAVE_COMMON_H -DHAVE_ENDIAN_H -DHAVE_STD_ARRAY -DHAVE_STD_UNORDERED_MAP -DNDEBUG -DOPENSSL_HAS_SET_ECDH_AUTO -I/pobj/galera-26.4.16/galera-release_26.4.16 -I/pobj/galera-26.4.16/galera-release_26.4.16/common -I/pobj/galera-26.4.16/galera-release_26.4.16/galera/src -I/pobj/galera-26.4.16/galera-release_26.4.16/galerautils/src -I/pobj/galera-26.4.16/galera-release_26.4.16/gcache/src -I/pobj/galera-26.4.16/galera-release_26.4.16/gcomm/src -I/pobj/galera-26.4.16/galera-release_26.4.16/gcs/src -I/pobj/galera-26.4.16/galera-release_26.4.16/wsrep/src -O2 -pipe -I/usr/local/include -Wall -Wextra -Woverloaded-virtual -g -DNDEBUG -std=gnu++11 -fPIC -Wno-conversion -Wno-unused-parameter -MD -MT galerautils/src/CMakeFiles/galerautilsxx.dir/gu_regex.cpp.o -MF galerautils/src/CMakeFiles/galerautilsxx.dir/gu_regex.cpp.o.d -o galerautils/src/CMakeFiles/galerautilsxx.dir/gu_regex.cpp.o -c /pobj/galera-26.4.16/galera-release_26.4.16/galerautils/src/gu_regex.cpp
[31/276] /pobj/galera-26.4.16/bin/c++ -DBOOST_DATE_TIME_POSIX_TIME_STD_CONFIG=1 -DGALERA_HAVE_SSL -DGU_CRC32C_NO_HARDWARE -DHAVE_ASIO_HPP -DHAVE_BOOST_SHARED_PTR_HPP -DHAVE_COMMON_H -DHAVE_ENDIAN_H -DHAVE_STD_ARRAY -DHAVE_STD_UNORDERED_MAP -DNDEBUG -DOPENSSL_HAS_SET_ECDH_AUTO -I/pobj/galera-26.4.16/galera-release_26.4.16 -I/pobj/galera-26.4.16/galera-release_26.4.16/common -I/pobj/galera-26.4.16/galera-release_26.4.16/galera/src -I/pobj/galera-26.4.16/galera-release_26.4.16/galerautils/src -I/pobj/galera-26.4.16/galera-release_26.4.16/gcache/src -I/pobj/galera-26.4.16/galera-release_26.4.16/gcomm/src -I/pobj/galera-26.4.16/galera-release_26.4.16/gcs/src -I/pobj/galera-26.4.16/galera-release_26.4.16/wsrep/src -O2 -pipe -I/usr/local/include -Wall -Wextra -Woverloaded-virtual -g -DNDEBUG -std=gnu++11 -fPIC -Wno-conversion -Wno-unused-parameter -MD -MT galerautils/src/CMakeFiles/galerautilsxx.dir/gu_string_utils.cpp.o -MF galerautils/src/CMakeFiles/galerautilsxx.dir/gu_string_utils.cpp.o.d -o galerautils/src/CMakeFiles/galerautilsxx.dir/gu_string_utils.cpp.o -c /pobj/galera-26.4.16/galera-release_26.4.16/galerautils/src/gu_string_utils.cpp
[32/276] /pobj/galera-26.4.16/bin/c++ -DBOOST_DATE_TIME_POSIX_TIME_STD_CONFIG=1 -DGALERA_HAVE_SSL -DGU_CRC32C_NO_HARDWARE -DHAVE_ASIO_HPP -DHAVE_BOOST_SHARED_PTR_HPP -DHAVE_COMMON_H -DHAVE_ENDIAN_H -DHAVE_STD_ARRAY -DHAVE_STD_UNORDERED_MAP -DNDEBUG -DOPENSSL_HAS_SET_ECDH_AUTO -I/pobj/galera-26.4.16/galera-release_26.4.16 -I/pobj/galera-26.4.16/galera-release_26.4.16/common -I/pobj/galera-26.4.16/galera-release_26.4.16/galera/src -I/pobj/galera-26.4.16/galera-release_26.4.16/galerautils/src -I/pobj/galera-26.4.16/galera-release_26.4.16/gcache/src -I/pobj/galera-26.4.16/galera-release_26.4.16/gcomm/src -I/pobj/galera-26.4.16/galera-release_26.4.16/gcs/src -I/pobj/galera-26.4.16/galera-release_26.4.16/wsrep/src -O2 -pipe -I/usr/local/include -Wall -Wextra -Woverloaded-virtual -g -DNDEBUG -std=gnu++11 -fPIC -Wno-conversion -Wno-unused-parameter -MD -MT galerautils/src/CMakeFiles/galerautilsxx.dir/gu_uri.cpp.o -MF galerautils/src/CMakeFiles/galerautilsxx.dir/gu_uri.cpp.o.d -o galerautils/src/CMakeFiles/galerautilsxx.dir/gu_uri.cpp.o -c /pobj/galera-26.4.16/galera-release_26.4.16/galerautils/src/gu_uri.cpp
[33/276] /pobj/galera-26.4.16/bin/c++ -DBOOST_DATE_TIME_POSIX_TIME_STD_CONFIG=1 -DGALERA_HAVE_SSL -DGU_CRC32C_NO_HARDWARE -DHAVE_ASIO_HPP -DHAVE_BOOST_SHARED_PTR_HPP -DHAVE_COMMON_H -DHAVE_ENDIAN_H -DHAVE_STD_ARRAY -DHAVE_STD_UNORDERED_MAP -DNDEBUG -DOPENSSL_HAS_SET_ECDH_AUTO -I/pobj/galera-26.4.16/galera-release_26.4.16 -I/pobj/galera-26.4.16/galera-release_26.4.16/common -I/pobj/galera-26.4.16/galera-release_26.4.16/galera/src -I/pobj/galera-26.4.16/galera-release_26.4.16/galerautils/src -I/pobj/galera-26.4.16/galera-release_26.4.16/gcache/src -I/pobj/galera-26.4.16/galera-release_26.4.16/gcomm/src -I/pobj/galera-26.4.16/galera-release_26.4.16/gcs/src -I/pobj/galera-26.4.16/galera-release_26.4.16/wsrep/src -O2 -pipe -I/usr/local/include -Wall -Wextra -Woverloaded-virtual -g -DNDEBUG -std=gnu++11 -fPIC -Wno-conversion -Wno-unused-parameter -MD -MT galerautils/src/CMakeFiles/galerautilsxx.dir/gu_buffer.cpp.o -MF galerautils/src/CMakeFiles/galerautilsxx.dir/gu_buffer.cpp.o.d -o galerautils/src/CMakeFiles/galerautilsxx.dir/gu_buffer.cpp.o -c /pobj/galera-26.4.16/galera-release_26.4.16/galerautils/src/gu_buffer.cpp
[34/276] /pobj/galera-26.4.16/bin/c++ -DBOOST_DATE_TIME_POSIX_TIME_STD_CONFIG=1 -DGALERA_HAVE_SSL -DGU_CRC32C_NO_HARDWARE -DHAVE_ASIO_HPP -DHAVE_BOOST_SHARED_PTR_HPP -DHAVE_COMMON_H -DHAVE_ENDIAN_H -DHAVE_STD_ARRAY -DHAVE_STD_UNORDERED_MAP -DNDEBUG -DOPENSSL_HAS_SET_ECDH_AUTO -I/pobj/galera-26.4.16/galera-release_26.4.16 -I/pobj/galera-26.4.16/galera-release_26.4.16/common -I/pobj/galera-26.4.16/galera-release_26.4.16/galera/src -I/pobj/galera-26.4.16/galera-release_26.4.16/galerautils/src -I/pobj/galera-26.4.16/galera-release_26.4.16/gcache/src -I/pobj/galera-26.4.16/galera-release_26.4.16/gcomm/src -I/pobj/galera-26.4.16/galera-release_26.4.16/gcs/src -I/pobj/galera-26.4.16/galera-release_26.4.16/wsrep/src -O2 -pipe -I/usr/local/include -Wall -Wextra -Woverloaded-virtual -g -DNDEBUG -std=gnu++11 -fPIC -Wno-conversion -Wno-unused-parameter -MD -MT galerautils/src/CMakeFiles/galerautilsxx.dir/gu_utils++.cpp.o -MF galerautils/src/CMakeFiles/galerautilsxx.dir/gu_utils++.cpp.o.d -o galerautils/src/CMakeFiles/galerautilsxx.dir/gu_utils++.cpp.o -c /pobj/galera-26.4.16/galera-release_26.4.16/galerautils/src/gu_utils++.cpp
[35/276] /pobj/galera-26.4.16/bin/c++ -DBOOST_DATE_TIME_POSIX_TIME_STD_CONFIG=1 -DGALERA_HAVE_SSL -DGU_CRC32C_NO_HARDWARE -DHAVE_ASIO_HPP -DHAVE_BOOST_SHARED_PTR_HPP -DHAVE_COMMON_H -DHAVE_ENDIAN_H -DHAVE_STD_ARRAY -DHAVE_STD_UNORDERED_MAP -DNDEBUG -DOPENSSL_HAS_SET_ECDH_AUTO -I/pobj/galera-26.4.16/galera-release_26.4.16 -I/pobj/galera-26.4.16/galera-release_26.4.16/common -I/pobj/galera-26.4.16/galera-release_26.4.16/galera/src -I/pobj/galera-26.4.16/galera-release_26.4.16/galerautils/src -I/pobj/galera-26.4.16/galera-release_26.4.16/gcache/src -I/pobj/galera-26.4.16/galera-release_26.4.16/gcomm/src -I/pobj/galera-26.4.16/galera-release_26.4.16/gcs/src -I/pobj/galera-26.4.16/galera-release_26.4.16/wsrep/src -O2 -pipe -I/usr/local/include -Wall -Wextra -Woverloaded-virtual -g -DNDEBUG -std=gnu++11 -fPIC -Wno-conversion -Wno-unused-parameter -MD -MT galerautils/src/CMakeFiles/galerautilsxx.dir/gu_config.cpp.o -MF galerautils/src/CMakeFiles/galerautilsxx.dir/gu_config.cpp.o.d -o galerautils/src/CMakeFiles/galerautilsxx.dir/gu_config.cpp.o -c /pobj/galera-26.4.16/galera-release_26.4.16/galerautils/src/gu_config.cpp
[36/276] /pobj/galera-26.4.16/bin/c++ -DBOOST_DATE_TIME_POSIX_TIME_STD_CONFIG=1 -DGALERA_HAVE_SSL -DGU_CRC32C_NO_HARDWARE -DHAVE_ASIO_HPP -DHAVE_BOOST_SHARED_PTR_HPP -DHAVE_COMMON_H -DHAVE_ENDIAN_H -DHAVE_STD_ARRAY -DHAVE_STD_UNORDERED_MAP -DNDEBUG -DOPENSSL_HAS_SET_ECDH_AUTO -I/pobj/galera-26.4.16/galera-release_26.4.16 -I/pobj/galera-26.4.16/galera-release_26.4.16/common -I/pobj/galera-26.4.16/galera-release_26.4.16/galera/src -I/pobj/galera-26.4.16/galera-release_26.4.16/galerautils/src -I/pobj/galera-26.4.16/galera-release_26.4.16/gcache/src -I/pobj/galera-26.4.16/galera-release_26.4.16/gcomm/src -I/pobj/galera-26.4.16/galera-release_26.4.16/gcs/src -I/pobj/galera-26.4.16/galera-release_26.4.16/wsrep/src -O2 -pipe -I/usr/local/include -Wall -Wextra -Woverloaded-virtual -g -DNDEBUG -std=gnu++11 -fPIC -Wno-conversion -Wno-unused-parameter -MD -MT galerautils/src/CMakeFiles/galerautilsxx.dir/gu_fdesc.cpp.o -MF galerautils/src/CMakeFiles/galerautilsxx.dir/gu_fdesc.cpp.o.d -o galerautils/src/CMakeFiles/galerautilsxx.dir/gu_fdesc.cpp.o -c /pobj/galera-26.4.16/galera-release_26.4.16/galerautils/src/gu_fdesc.cpp
[37/276] /pobj/galera-26.4.16/bin/c++ -DBOOST_DATE_TIME_POSIX_TIME_STD_CONFIG=1 -DGALERA_HAVE_SSL -DGU_CRC32C_NO_HARDWARE -DHAVE_ASIO_HPP -DHAVE_BOOST_SHARED_PTR_HPP -DHAVE_COMMON_H -DHAVE_ENDIAN_H -DHAVE_STD_ARRAY -DHAVE_STD_UNORDERED_MAP -DNDEBUG -DOPENSSL_HAS_SET_ECDH_AUTO -I/pobj/galera-26.4.16/galera-release_26.4.16 -I/pobj/galera-26.4.16/galera-release_26.4.16/common -I/pobj/galera-26.4.16/galera-release_26.4.16/galera/src -I/pobj/galera-26.4.16/galera-release_26.4.16/galerautils/src -I/pobj/galera-26.4.16/galera-release_26.4.16/gcache/src -I/pobj/galera-26.4.16/galera-release_26.4.16/gcomm/src -I/pobj/galera-26.4.16/galera-release_26.4.16/gcs/src -I/pobj/galera-26.4.16/galera-release_26.4.16/wsrep/src -O2 -pipe -I/usr/local/include -Wall -Wextra -Woverloaded-virtual -g -DNDEBUG -std=gnu++11 -fPIC -Wno-conversion -Wno-unused-parameter -MD -MT galerautils/src/CMakeFiles/galerautilsxx.dir/gu_mmap.cpp.o -MF galerautils/src/CMakeFiles/galerautilsxx.dir/gu_mmap.cpp.o.d -o galerautils/src/CMakeFiles/galerautilsxx.dir/gu_mmap.cpp.o -c /pobj/galera-26.4.16/galera-release_26.4.16/galerautils/src/gu_mmap.cpp
[38/276] /pobj/galera-26.4.16/bin/c++ -DBOOST_DATE_TIME_POSIX_TIME_STD_CONFIG=1 -DGALERA_HAVE_SSL -DGU_CRC32C_NO_HARDWARE -DHAVE_ASIO_HPP -DHAVE_BOOST_SHARED_PTR_HPP -DHAVE_COMMON_H -DHAVE_ENDIAN_H -DHAVE_STD_ARRAY -DHAVE_STD_UNORDERED_MAP -DNDEBUG -DOPENSSL_HAS_SET_ECDH_AUTO -I/pobj/galera-26.4.16/galera-release_26.4.16 -I/pobj/galera-26.4.16/galera-release_26.4.16/common -I/pobj/galera-26.4.16/galera-release_26.4.16/galera/src -I/pobj/galera-26.4.16/galera-release_26.4.16/galerautils/src -I/pobj/galera-26.4.16/galera-release_26.4.16/gcache/src -I/pobj/galera-26.4.16/galera-release_26.4.16/gcomm/src -I/pobj/galera-26.4.16/galera-release_26.4.16/gcs/src -I/pobj/galera-26.4.16/galera-release_26.4.16/wsrep/src -O2 -pipe -I/usr/local/include -Wall -Wextra -Woverloaded-virtual -g -DNDEBUG -std=gnu++11 -fPIC -Wno-conversion -Wno-unused-parameter -MD -MT galerautils/src/CMakeFiles/galerautilsxx.dir/gu_alloc.cpp.o -MF galerautils/src/CMakeFiles/galerautilsxx.dir/gu_alloc.cpp.o.d -o galerautils/src/CMakeFiles/galerautilsxx.dir/gu_alloc.cpp.o -c /pobj/galera-26.4.16/galera-release_26.4.16/galerautils/src/gu_alloc.cpp
[39/276] /pobj/galera-26.4.16/bin/c++ -DBOOST_DATE_TIME_POSIX_TIME_STD_CONFIG=1 -DGALERA_HAVE_SSL -DGU_CRC32C_NO_HARDWARE -DHAVE_ASIO_HPP -DHAVE_BOOST_SHARED_PTR_HPP -DHAVE_COMMON_H -DHAVE_ENDIAN_H -DHAVE_STD_ARRAY -DHAVE_STD_UNORDERED_MAP -DNDEBUG -DOPENSSL_HAS_SET_ECDH_AUTO -I/pobj/galera-26.4.16/galera-release_26.4.16 -I/pobj/galera-26.4.16/galera-release_26.4.16/common -I/pobj/galera-26.4.16/galera-release_26.4.16/galera/src -I/pobj/galera-26.4.16/galera-release_26.4.16/galerautils/src -I/pobj/galera-26.4.16/galera-release_26.4.16/gcache/src -I/pobj/galera-26.4.16/galera-release_26.4.16/gcomm/src -I/pobj/galera-26.4.16/galera-release_26.4.16/gcs/src -I/pobj/galera-26.4.16/galera-release_26.4.16/wsrep/src -O2 -pipe -I/usr/local/include -Wall -Wextra -Woverloaded-virtual -g -DNDEBUG -std=gnu++11 -fPIC -Wno-conversion -Wno-unused-parameter -MD -MT galerautils/src/CMakeFiles/galerautilsxx.dir/gu_rset.cpp.o -MF galerautils/src/CMakeFiles/galerautilsxx.dir/gu_rset.cpp.o.d -o galerautils/src/CMakeFiles/galerautilsxx.dir/gu_rset.cpp.o -c /pobj/galera-26.4.16/galera-release_26.4.16/galerautils/src/gu_rset.cpp
[40/276] /pobj/galera-26.4.16/bin/c++ -DBOOST_DATE_TIME_POSIX_TIME_STD_CONFIG=1 -DGALERA_HAVE_SSL -DGU_CRC32C_NO_HARDWARE -DHAVE_ASIO_HPP -DHAVE_BOOST_SHARED_PTR_HPP -DHAVE_COMMON_H -DHAVE_ENDIAN_H -DHAVE_STD_ARRAY -DHAVE_STD_UNORDERED_MAP -DNDEBUG -DOPENSSL_HAS_SET_ECDH_AUTO -I/pobj/galera-26.4.16/galera-release_26.4.16 -I/pobj/galera-26.4.16/galera-release_26.4.16/common -I/pobj/galera-26.4.16/galera-release_26.4.16/galera/src -I/pobj/galera-26.4.16/galera-release_26.4.16/galerautils/src -I/pobj/galera-26.4.16/galera-release_26.4.16/gcache/src -I/pobj/galera-26.4.16/galera-release_26.4.16/gcomm/src -I/pobj/galera-26.4.16/galera-release_26.4.16/gcs/src -I/pobj/galera-26.4.16/galera-release_26.4.16/wsrep/src -O2 -pipe -I/usr/local/include -Wall -Wextra -Woverloaded-virtual -g -DNDEBUG -std=gnu++11 -fPIC -Wno-conversion -Wno-unused-parameter -MD -MT galerautils/src/CMakeFiles/galerautilsxx.dir/gu_resolver.cpp.o -MF galerautils/src/CMakeFiles/galerautilsxx.dir/gu_resolver.cpp.o.d -o galerautils/src/CMakeFiles/galerautilsxx.dir/gu_resolver.cpp.o -c /pobj/galera-26.4.16/galera-release_26.4.16/galerautils/src/gu_resolver.cpp
[41/276] /pobj/galera-26.4.16/bin/c++ -DBOOST_DATE_TIME_POSIX_TIME_STD_CONFIG=1 -DGALERA_HAVE_SSL -DGU_CRC32C_NO_HARDWARE -DHAVE_ASIO_HPP -DHAVE_BOOST_SHARED_PTR_HPP -DHAVE_COMMON_H -DHAVE_ENDIAN_H -DHAVE_STD_ARRAY -DHAVE_STD_UNORDERED_MAP -DNDEBUG -DOPENSSL_HAS_SET_ECDH_AUTO -I/pobj/galera-26.4.16/galera-release_26.4.16 -I/pobj/galera-26.4.16/galera-release_26.4.16/common -I/pobj/galera-26.4.16/galera-release_26.4.16/galera/src -I/pobj/galera-26.4.16/galera-release_26.4.16/galerautils/src -I/pobj/galera-26.4.16/galera-release_26.4.16/gcache/src -I/pobj/galera-26.4.16/galera-release_26.4.16/gcomm/src -I/pobj/galera-26.4.16/galera-release_26.4.16/gcs/src -I/pobj/galera-26.4.16/galera-release_26.4.16/wsrep/src -O2 -pipe -I/usr/local/include -Wall -Wextra -Woverloaded-virtual -g -DNDEBUG -std=gnu++11 -fPIC -Wno-conversion -Wno-unused-parameter -MD -MT galerautils/src/CMakeFiles/galerautilsxx.dir/gu_histogram.cpp.o -MF galerautils/src/CMakeFiles/galerautilsxx.dir/gu_histogram.cpp.o.d -o galerautils/src/CMakeFiles/galerautilsxx.dir/gu_histogram.cpp.o -c /pobj/galera-26.4.16/galera-release_26.4.16/galerautils/src/gu_histogram.cpp
[42/276] /pobj/galera-26.4.16/bin/c++ -DBOOST_DATE_TIME_POSIX_TIME_STD_CONFIG=1 -DGALERA_HAVE_SSL -DGU_CRC32C_NO_HARDWARE -DHAVE_ASIO_HPP -DHAVE_BOOST_SHARED_PTR_HPP -DHAVE_COMMON_H -DHAVE_ENDIAN_H -DHAVE_STD_ARRAY -DHAVE_STD_UNORDERED_MAP -DNDEBUG -DOPENSSL_HAS_SET_ECDH_AUTO -I/pobj/galera-26.4.16/galera-release_26.4.16 -I/pobj/galera-26.4.16/galera-release_26.4.16/common -I/pobj/galera-26.4.16/galera-release_26.4.16/galera/src -I/pobj/galera-26.4.16/galera-release_26.4.16/galerautils/src -I/pobj/galera-26.4.16/galera-release_26.4.16/gcache/src -I/pobj/galera-26.4.16/galera-release_26.4.16/gcomm/src -I/pobj/galera-26.4.16/galera-release_26.4.16/gcs/src -I/pobj/galera-26.4.16/galera-release_26.4.16/wsrep/src -O2 -pipe -I/usr/local/include -Wall -Wextra -Woverloaded-virtual -g -DNDEBUG -std=gnu++11 -fPIC -Wno-conversion -Wno-unused-parameter -MD -MT galerautils/src/CMakeFiles/galerautilsxx.dir/gu_signals.cpp.o -MF galerautils/src/CMakeFiles/galerautilsxx.dir/gu_signals.cpp.o.d -o galerautils/src/CMakeFiles/galerautilsxx.dir/gu_signals.cpp.o -c /pobj/galera-26.4.16/galera-release_26.4.16/galerautils/src/gu_signals.cpp
[43/276] /pobj/galera-26.4.16/bin/c++ -DBOOST_DATE_TIME_POSIX_TIME_STD_CONFIG=1 -DGALERA_HAVE_SSL -DGU_CRC32C_NO_HARDWARE -DHAVE_ASIO_HPP -DHAVE_BOOST_SHARED_PTR_HPP -DHAVE_COMMON_H -DHAVE_ENDIAN_H -DHAVE_STD_ARRAY -DHAVE_STD_UNORDERED_MAP -DNDEBUG -DOPENSSL_HAS_SET_ECDH_AUTO -I/pobj/galera-26.4.16/galera-release_26.4.16 -I/pobj/galera-26.4.16/galera-release_26.4.16/common -I/pobj/galera-26.4.16/galera-release_26.4.16/galera/src -I/pobj/galera-26.4.16/galera-release_26.4.16/galerautils/src -I/pobj/galera-26.4.16/galera-release_26.4.16/gcache/src -I/pobj/galera-26.4.16/galera-release_26.4.16/gcomm/src -I/pobj/galera-26.4.16/galera-release_26.4.16/gcs/src -I/pobj/galera-26.4.16/galera-release_26.4.16/wsrep/src -O2 -pipe -I/usr/local/include -Wall -Wextra -Woverloaded-virtual -g -DNDEBUG -std=gnu++11 -fPIC -Wno-conversion -Wno-unused-parameter -MD -MT galerautils/src/CMakeFiles/galerautilsxx.dir/gu_stats.cpp.o -MF galerautils/src/CMakeFiles/galerautilsxx.dir/gu_stats.cpp.o.d -o galerautils/src/CMakeFiles/galerautilsxx.dir/gu_stats.cpp.o -c /pobj/galera-26.4.16/galera-release_26.4.16/galerautils/src/gu_stats.cpp
[44/276] /pobj/galera-26.4.16/bin/c++ -DBOOST_DATE_TIME_POSIX_TIME_STD_CONFIG=1 -DGALERA_HAVE_SSL -DGU_CRC32C_NO_HARDWARE -DHAVE_ASIO_HPP -DHAVE_BOOST_SHARED_PTR_HPP -DHAVE_COMMON_H -DHAVE_ENDIAN_H -DHAVE_STD_ARRAY -DHAVE_STD_UNORDERED_MAP -DNDEBUG -DOPENSSL_HAS_SET_ECDH_AUTO -I/pobj/galera-26.4.16/galera-release_26.4.16 -I/pobj/galera-26.4.16/galera-release_26.4.16/common -I/pobj/galera-26.4.16/galera-release_26.4.16/galera/src -I/pobj/galera-26.4.16/galera-release_26.4.16/galerautils/src -I/pobj/galera-26.4.16/galera-release_26.4.16/gcache/src -I/pobj/galera-26.4.16/galera-release_26.4.16/gcomm/src -I/pobj/galera-26.4.16/galera-release_26.4.16/gcs/src -I/pobj/galera-26.4.16/galera-release_26.4.16/wsrep/src -O2 -pipe -I/usr/local/include -Wall -Wextra -Woverloaded-virtual -g -DNDEBUG -std=gnu++11 -fPIC -Wno-conversion -Wno-unused-parameter -MD -MT galerautils/src/CMakeFiles/galerautilsxx.dir/gu_asio.cpp.o -MF galerautils/src/CMakeFiles/galerautilsxx.dir/gu_asio.cpp.o.d -o galerautils/src/CMakeFiles/galerautilsxx.dir/gu_asio.cpp.o -c /pobj/galera-26.4.16/galera-release_26.4.16/galerautils/src/gu_asio.cpp
FAILED: galerautils/src/CMakeFiles/galerautilsxx.dir/gu_asio.cpp.o
/pobj/galera-26.4.16/bin/c++ -DBOOST_DATE_TIME_POSIX_TIME_STD_CONFIG=1 -DGALERA_HAVE_SSL -DGU_CRC32C_NO_HARDWARE -DHAVE_ASIO_HPP -DHAVE_BOOST_SHARED_PTR_HPP -DHAVE_COMMON_H -DHAVE_ENDIAN_H -DHAVE_STD_ARRAY -DHAVE_STD_UNORDERED_MAP -DNDEBUG -DOPENSSL_HAS_SET_ECDH_AUTO -I/pobj/galera-26.4.16/galera-release_26.4.16 -I/pobj/galera-26.4.16/galera-release_26.4.16/common -I/pobj/galera-26.4.16/galera-release_26.4.16/galera/src -I/pobj/galera-26.4.16/galera-release_26.4.16/galerautils/src -I/pobj/galera-26.4.16/galera-release_26.4.16/gcache/src -I/pobj/galera-26.4.16/galera-release_26.4.16/gcomm/src -I/pobj/galera-26.4.16/galera-release_26.4.16/gcs/src -I/pobj/galera-26.4.16/galera-release_26.4.16/wsrep/src -O2 -pipe -I/usr/local/include -Wall -Wextra -Woverloaded-virtual -g -DNDEBUG -std=gnu++11 -fPIC -Wno-conversion -Wno-unused-parameter -MD -MT galerautils/src/CMakeFiles/galerautilsxx.dir/gu_asio.cpp.o -MF galerautils/src/CMakeFiles/galerautilsxx.dir/gu_asio.cpp.o.d -o galerautils/src/CMakeFiles/galerautilsxx.dir/gu_asio.cpp.o -c /pobj/galera-26.4.16/galera-release_26.4.16/galerautils/src/gu_asio.cpp
In file included from /pobj/galera-26.4.16/galera-release_26.4.16/galerautils/src/gu_asio.cpp:23:
/pobj/galera-26.4.16/galera-release_26.4.16/galerautils/src/gu_asio_datagram.hpp:38:34: error: no type named 'iterator' in 'asio::ip::basic_resolver<asio::ip::udp>'
38 | asio::ip::udp::resolver::iterator resolve_and_open(const gu::URI& uri);
| ~~~~~~~~~~~~~~~~~~~~~~~~~^
In file included from /pobj/galera-26.4.16/galera-release_26.4.16/galerautils/src/gu_asio.cpp:26:
/pobj/galera-26.4.16/galera-release_26.4.16/galerautils/src/gu_asio_io_service_impl.hpp:19:10: fatal error: 'asio/io_service.hpp' file not found
19 | #include "asio/io_service.hpp"
| ^~~~~~~~~~~~~~~~~~~~~
2 errors generated.
ninja: build stopped: subcommand failed.
*** Error 1 in databases/galera (/usr/ports/devel/cmake/cmake.port.mk:40 'do-build': @cd /pobj/galera-26.4.16/build-i386 && exec /usr/bin/en...)
*** Error 2 in databases/galera (/usr/ports/infrastructure/mk/bsd.port.mk:3084 '/pobj/galera-26.4.16/build-i386/.build_done': @cd /usr/ports...)
*** Error 2 in databases/galera (/usr/ports/infrastructure/mk/bsd.port.mk:2723 'build': @lock=galera-26.4.16; export _LOCKS_HELD=" galera-2...)
===> Exiting databases/galera with an error
*** Error 1 in /usr/ports (infrastructure/mk/bsd.port.subdir.mk:144 'build': @: ${echo_msg:=echo}; : ${target:=build}; for i in ; do eval...)
>>> Ended at 1791273921.12
max_stuck=8.70/depends=11.84/show-prepare-results=2.21/patch=2.89/configure=20.87/build=61.53
Error: job failed with 512 on i386-3 at 1791273921
UPDATE: Asio 1.36.0